Reaction Details
TargetAldo-keto reductase family 1 member B1
LigandBDBM50336355
Substrate/Competitorn/a
Meas. Tech.ChEMBL_716749 (CHEMBL1670631)
IC50 900±n/a nM
Citation Zou, XQPeng, SMHu, CPTan, LFDeng, HWLi, YJ Furoxan nitric oxide donor coupled chrysin derivatives: synthesis and vasculoprotection. Bioorg Med Chem Lett21:1222-6 (2011) 
 
Aldo-keto reductase family 1 member B1
Name:Aldo-keto reductase family 1 member B1
Type:Protein
Mol. Mass.:35855.50
Organism:Homo sapiens (Human)
Description:P15121. 4LAU; 2IKI; 4LB4; 2FZD; 2FZ8; 1US0
Residue:316
BDBM50336355
NameBDBM50336355
Synonyms:CHEMBL1668048 | O5-acetyl-O7-Chrysin acetic acid(4-phenyl-1,2,5-oxadiazole-2-oxide-3-)methyl ester
TypeSmall organic molecule
Emp. Form.C28H20N2O9
Mol. Mass.528.4664
SMILESCC(=O)Oc1cc(OCC(=O)OCc2c(no[n+]2[O-])-c2ccccc2)cc2oc(cc(=O)c12)-c1ccccc1