Reaction Details
TargetAldo-keto reductase family 1 member B1
LigandBDBM50336357
Substrate/Competitorn/a
Meas. Tech.ChEMBL_716749 (CHEMBL1670631)
IC50 1930±n/a nM
Citation Zou, XQPeng, SMHu, CPTan, LFDeng, HWLi, YJ Furoxan nitric oxide donor coupled chrysin derivatives: synthesis and vasculoprotection. Bioorg Med Chem Lett21:1222-6 (2011) 
 
Aldo-keto reductase family 1 member B1
Name:Aldo-keto reductase family 1 member B1
Type:Protein
Mol. Mass.:35855.50
Organism:Homo sapiens (Human)
Description:P15121. 4LAU; 2IKI; 4LB4; 2FZD; 2FZ8; 1US0
Residue:316
BDBM50336357
NameBDBM50336357
Synonyms:3-((4-((2-(5-acetoxy-4-oxo-2-phenyl-4H-chromen-7-yloxy)acetoxy)methyl)phenoxy)methyl)-4-phenyl-1,2,5-oxadiazole 2-oxide | CHEMBL1668047
TypeSmall organic molecule
Emp. Form.C35H26N2O10
Mol. Mass.634.5883
SMILESCC(=O)Oc1cc(OCC(=O)OCc2ccc(OCc3c(no[n+]3[O-])-c3ccccc3)cc2)cc2oc(cc(=O)c12)-c1ccccc1