Reaction Details
TargetPolyphenol oxidase 2
LigandBDBM50336361
Substrate/Competitorn/a
Meas. Tech.ChEMBL_716754 (CHEMBL1670636)
Ki 1110±n/a nM
Citation Fang, YChen, YFeng, GMa, L Benzyl benzoates: New phlorizin analogs as mushroom tyrosinase inhibitors. Bioorg Med Chem19:1167-71 (2011) 
 
Polyphenol oxidase 2
Name:Polyphenol oxidase 2
Type:Protein
Mol. Mass.:63923.66
Organism:Agaricus bisporus (Common mushroom)
Description:O42713
Residue:556
BDBM50336361
NameBDBM50336361
Synonyms:4-Hydroxybenzyl 2,4-dihydroxybenzoate | CHEMBL1668051
TypeSmall organic molecule
Emp. Form.C14H12O5
Mol. Mass.260.2421
SMILESOc1ccc(COC(=O)c2ccc(O)cc2O)cc1