Reaction Details
TargetBile acid receptor
LigandBDBM50336375
Substrate/Competitorn/a
Meas. Tech.ChEMBL_716784 (CHEMBL1670706)
IC50 1±n/a nM
Citation Richter, HGBenson, GMBleicher, KHBlum, DChaput, EClemann, NFeng, SGardes, CGrether, UHartman, PKuhn, BMartin, REPlancher, JMRudolph, MGSchuler, FTaylor, S Optimization of a novel class of benzimidazole-based farnesoid X receptor (FXR) agonists to improve physicochemical and ADME properties. Bioorg Med Chem Lett21:1134-40 (2011) 
 
Bile acid receptor
Name:Bile acid receptor
Type:Nuclear Receptor
Mol. Mass.:55916.24
Organism:Homo sapiens (Human)
Description:Q96RI1
Residue:486
BDBM50336375
NameBDBM50336375
Synonyms:(S)-1-(4-(2-(2-(4-chlorophenyl)-5,6-difluoro-1H-benzo[d]imidazol-1-yl)-2-cyclohexylacetamido)-3-fluorophenoxy)cyclopropanecarboxylic acid | CHEMBL1668249
TypeSmall organic molecule
Emp. Form.C31H27ClF3N3O4
Mol. Mass.598.012
SMILESOC(=O)C1(CC1)Oc1ccc(NC(=O)[C@H](C2CCCCC2)n2c(nc3cc(F)c(F)cc23)-c2ccc(Cl)cc2)c(F)c1