Reaction Details
TargetBile acid receptor
LigandBDBM50336381
Substrate/Competitorn/a
Meas. Tech.ChEMBL_716784 (CHEMBL1670706)
IC50 10±n/a nM
Citation Richter, HGBenson, GMBleicher, KHBlum, DChaput, EClemann, NFeng, SGardes, CGrether, UHartman, PKuhn, BMartin, REPlancher, JMRudolph, MGSchuler, FTaylor, S Optimization of a novel class of benzimidazole-based farnesoid X receptor (FXR) agonists to improve physicochemical and ADME properties. Bioorg Med Chem Lett21:1134-40 (2011) 
 
Bile acid receptor
Name:Bile acid receptor
Type:Nuclear Receptor
Mol. Mass.:55916.24
Organism:Homo sapiens (Human)
Description:Q96RI1
Residue:486
BDBM50336381
NameBDBM50336381
Synonyms:(S)-4-(2-(2-(4-chlorophenyl)-1H-benzo[d]imidazol-1-yl)-2-cyclohexylacetamido)-3-(trifluoromethyl)benzoic acid | CHEMBL1668259
TypeSmall organic molecule
Emp. Form.C29H25ClF3N3O3
Mol. Mass.555.975
SMILESOC(=O)c1ccc(NC(=O)[C@H](C2CCCCC2)n2c(nc3ccccc23)-c2ccc(Cl)cc2)c(c1)C(F)(F)F