Reaction Details
TargetPotassium voltage-gated channel subfamily H member 2
LigandBDBM50334234
Substrate/Competitorn/a
Meas. Tech.ChEMBL_716794 (CHEMBL1670716)
IC50 1600±n/a nM
Citation Richter, HGBenson, GMBleicher, KHBlum, DChaput, EClemann, NFeng, SGardes, CGrether, UHartman, PKuhn, BMartin, REPlancher, JMRudolph, MGSchuler, FTaylor, S Optimization of a novel class of benzimidazole-based farnesoid X receptor (FXR) agonists to improve physicochemical and ADME properties. Bioorg Med Chem Lett21:1134-40 (2011) 
 
Potassium voltage-gated channel subfamily H member 2
Name:Potassium voltage-gated channel subfamily H member 2
Type:Multi-pass membrane protein
Mol. Mass.:126672.65
Organism:Homo sapiens (Human)
Description:Q12809
Residue:1159
BDBM50334234
NameBDBM50334234
Synonyms:(S)-2-(6-chloro-2-(4-chlorophenyl)-5-fluoro-1H-benzo[d]imidazol-1-yl)-N,2-dicyclohexylacetamide | CHEMBL1642362
TypeSmall organic molecule
Emp. Form.C27H30Cl2FN3O
Mol. Mass.502.451
SMILESFc1cc2nc(-c3ccc(Cl)cc3)n([C@@H](C3CCCCC3)C(=O)NC3CCCCC3)c2cc1Cl