Reaction Details
TargetPotassium voltage-gated channel subfamily H member 2
LigandBDBM50336378
Substrate/Competitorn/a
Meas. Tech.ChEMBL_716794 (CHEMBL1670716)
IC50>10000±n/a nM
Citation Richter, HGBenson, GMBleicher, KHBlum, DChaput, EClemann, NFeng, SGardes, CGrether, UHartman, PKuhn, BMartin, REPlancher, JMRudolph, MGSchuler, FTaylor, S Optimization of a novel class of benzimidazole-based farnesoid X receptor (FXR) agonists to improve physicochemical and ADME properties. Bioorg Med Chem Lett21:1134-40 (2011) 
 
Potassium voltage-gated channel subfamily H member 2
Name:Potassium voltage-gated channel subfamily H member 2
Type:Multi-pass membrane protein
Mol. Mass.:126672.65
Organism:Homo sapiens (Human)
Description:Q12809
Residue:1159
BDBM50336378
NameBDBM50336378
Synonyms:(S)-2-(2-(4-chlorophenyl)-5,6-difluoro-1H-benzo[d]imidazol-1-yl)-2-cyclohexyl-N-(2-fluoro-4-(1H-tetrazol-5-yl)phenyl)acetamide | CHEMBL1668257
TypeSmall organic molecule
Emp. Form.C28H23ClF3N7O
Mol. Mass.565.977
SMILESFc1cc2nc(-c3ccc(Cl)cc3)n([C@@H](C3CCCCC3)C(=O)Nc3ccc(cc3F)-c3nnn[nH]3)c2cc1F