Reaction Details
TargetBile acid receptor
LigandBDBM50336398
Substrate/Competitorn/a
Meas. Tech.ChEMBL_716784 (CHEMBL1670706)
IC50 740±n/a nM
Citation Richter, HGBenson, GMBleicher, KHBlum, DChaput, EClemann, NFeng, SGardes, CGrether, UHartman, PKuhn, BMartin, REPlancher, JMRudolph, MGSchuler, FTaylor, S Optimization of a novel class of benzimidazole-based farnesoid X receptor (FXR) agonists to improve physicochemical and ADME properties. Bioorg Med Chem Lett21:1134-40 (2011) 
 
Bile acid receptor
Name:Bile acid receptor
Type:Nuclear Receptor
Mol. Mass.:55916.24
Organism:Homo sapiens (Human)
Description:Q96RI1
Residue:486
BDBM50336398
NameBDBM50336398
Synonyms:(S)-4-(2-(2-(4-chlorophenyl)-5,6-difluoro-1H-benzo[d]imidazol-1-yl)-2-cyclohexylacetamido)-3-methoxybenzoic acid | CHEMBL1668245
TypeSmall organic molecule
Emp. Form.C29H26ClF2N3O4
Mol. Mass.553.984
SMILESCOc1cc(ccc1NC(=O)[C@H](C1CCCCC1)n1c(nc2cc(F)c(F)cc12)-c1ccc(Cl)cc1)C(O)=O