Reaction Details
TargetBile acid receptor
LigandBDBM50336394
Substrate/Competitorn/a
Meas. Tech.ChEMBL_716785 (CHEMBL1670707)
EC50 10400±n/a nM
Citation Richter, HGBenson, GMBleicher, KHBlum, DChaput, EClemann, NFeng, SGardes, CGrether, UHartman, PKuhn, BMartin, REPlancher, JMRudolph, MGSchuler, FTaylor, S Optimization of a novel class of benzimidazole-based farnesoid X receptor (FXR) agonists to improve physicochemical and ADME properties. Bioorg Med Chem Lett21:1134-40 (2011) 
 
Bile acid receptor
Name:Bile acid receptor
Type:Nuclear Receptor
Mol. Mass.:55916.24
Organism:Homo sapiens (Human)
Description:Q96RI1
Residue:486
BDBM50336394
NameBDBM50336394
Synonyms:CHEMBL1668253 | rac-2-(2-(2-(4-chlorophenyl)-5,6-difluoro-1H-benzo[d]imidazol-1-yl)-2-cyclohexylacetamido)-4-methylthiazole-5-carboxylic acid
TypeSmall organic molecule
Emp. Form.C26H23ClF2N4O3S
Mol. Mass.545.001
SMILESCc1nc(NC(=O)C(C2CCCCC2)n2c(nc3cc(F)c(F)cc23)-c2ccc(Cl)cc2)sc1C(O)=O