Reaction Details
TargetCytochrome P450 2C9
LigandBDBM50336380
Substrate/Competitorn/a
Meas. Tech.ChEMBL_716791 (CHEMBL1670713)
IC50 6700±n/a nM
Citation Richter, HGBenson, GMBleicher, KHBlum, DChaput, EClemann, NFeng, SGardes, CGrether, UHartman, PKuhn, BMartin, REPlancher, JMRudolph, MGSchuler, FTaylor, S Optimization of a novel class of benzimidazole-based farnesoid X receptor (FXR) agonists to improve physicochemical and ADME properties. Bioorg Med Chem Lett21:1134-40 (2011) 
 
Cytochrome P450 2C9
Name:Cytochrome P450 2C9
Type:Enzyme
Mol. Mass.:55636.33
Organism:Homo sapiens (Human)
Description:P11712
Residue:490
BDBM50336380
NameBDBM50336380
Synonyms:(S)-2-(2-(4-chlorophenyl)-5,6-difluoro-1H-benzo[d]imidazol-1-yl)-N,2-dicyclohexylacetamide | CHEMBL1668238
TypeSmall organic molecule
Emp. Form.C27H30ClF2N3O
Mol. Mass.485.996
SMILESFc1cc2nc(-c3ccc(Cl)cc3)n([C@@H](C3CCCCC3)C(=O)NC3CCCCC3)c2cc1F