Reaction Details
TargetPhosphatidylinositol 4,5-bisphosphate 3-kinase catalytic subunit alpha isoform
LigandBDBM50336415
Substrate/Competitorn/a
Meas. Tech.ChEMBL_716816 (CHEMBL1670738)
Ki 54±n/a nM
Citation Liu, KKHuang, XBagrodia, SChen, JHGreasley, SCheng, HSun, SKnighton, DRodgers, CRafidi, KZou, AXiao, JYan, S Quinazolines with intra-molecular hydrogen bonding scaffold (iMHBS) as PI3K/mTOR dual inhibitors. Bioorg Med Chem Lett21:1270-4 (2011) 
 
Phosphatidylinositol 4,5-bisphosphate 3-kinase catalytic subunit alpha isoform
Name:Phosphatidylinositol 4,5-bisphosphate 3-kinase catalytic subunit alpha isoform
Type:Enzyme Subunit
Mol. Mass.:124294.87
Organism:Homo sapiens (Human)
Description:P42336
Residue:1068
BDBM50336415
NameBDBM50336415
Synonyms:4-amino-N-(6-(dimethylamino)pyridin-3-yl)-2-methylquinazoline-8-carboxamide | CHEMBL1668272
TypeSmall organic molecule
Emp. Form.C17H18N6O
Mol. Mass.322.3644
SMILESCN(C)c1ccc(NC(=O)c2cccc3c(N)nc(C)nc23)cn1