Reaction Details
TargetPhosphatidylinositol 4,5-bisphosphate 3-kinase catalytic subunit alpha isoform
LigandBDBM50336418
Substrate/Competitorn/a
Meas. Tech.ChEMBL_716816 (CHEMBL1670738)
Ki 1±n/a nM
Citation Liu, KKHuang, XBagrodia, SChen, JHGreasley, SCheng, HSun, SKnighton, DRodgers, CRafidi, KZou, AXiao, JYan, S Quinazolines with intra-molecular hydrogen bonding scaffold (iMHBS) as PI3K/mTOR dual inhibitors. Bioorg Med Chem Lett21:1270-4 (2011) 
 
Phosphatidylinositol 4,5-bisphosphate 3-kinase catalytic subunit alpha isoform
Name:Phosphatidylinositol 4,5-bisphosphate 3-kinase catalytic subunit alpha isoform
Type:Enzyme Subunit
Mol. Mass.:124294.87
Organism:Homo sapiens (Human)
Description:P42336
Residue:1068
BDBM50336418
NameBDBM50336418
Synonyms:4-amino-2-methyl-N-(1H-pyrrolo[2,3-b]pyridin-5-yl)quinazoline-8-carboxamide | CHEMBL1668275
TypeSmall organic molecule
Emp. Form.C17H14N6O
Mol. Mass.318.3327
SMILESCc1nc(N)c2cccc(C(=O)Nc3cnc4[nH]ccc4c3)c2n1