Reaction Details
TargetSerine/threonine-protein kinase mTOR
LigandBDBM50336417
Substrate/Competitorn/a
Meas. Tech.ChEMBL_716817 (CHEMBL1670739)
Ki 162±n/a nM
Citation Liu, KKHuang, XBagrodia, SChen, JHGreasley, SCheng, HSun, SKnighton, DRodgers, CRafidi, KZou, AXiao, JYan, S Quinazolines with intra-molecular hydrogen bonding scaffold (iMHBS) as PI3K/mTOR dual inhibitors. Bioorg Med Chem Lett21:1270-4 (2011) 
 
Serine/threonine-protein kinase mTOR
Name:Serine/threonine-protein kinase mTOR
Type:Rapamycin target protein
Mol. Mass.:288917.12
Organism:Homo sapiens (Human)
Description:P42345
Residue:2549
BDBM50336417
NameBDBM50336417
Synonyms:4-amino-N-(6-(dimethylamino)pyridin-3-yl)-2,6-dimethylquinazoline-8-carboxamide | CHEMBL1668274
TypeSmall organic molecule
Emp. Form.C18H20N6O
Mol. Mass.336.391
SMILESCN(C)c1ccc(NC(=O)c2cc(C)cc3c(N)nc(C)nc23)cn1