Reaction Details
TargetSerine/threonine-protein kinase mTOR
LigandBDBM50336407
Substrate/Competitorn/a
Meas. Tech.ChEMBL_716817 (CHEMBL1670739)
Ki 17±n/a nM
Citation Liu, KKHuang, XBagrodia, SChen, JHGreasley, SCheng, HSun, SKnighton, DRodgers, CRafidi, KZou, AXiao, JYan, S Quinazolines with intra-molecular hydrogen bonding scaffold (iMHBS) as PI3K/mTOR dual inhibitors. Bioorg Med Chem Lett21:1270-4 (2011) 
 
Serine/threonine-protein kinase mTOR
Name:Serine/threonine-protein kinase mTOR
Type:Rapamycin target protein
Mol. Mass.:288917.12
Organism:Homo sapiens (Human)
Description:P42345
Residue:2549
BDBM50336407
NameBDBM50336407
Synonyms:4-amino-2,6-dimethyl-N-(1H-pyrrolo[2,3-b]pyridin-5-yl)quinazoline-8-carboxamide | CHEMBL1668277
TypeSmall organic molecule
Emp. Form.C18H16N6O
Mol. Mass.332.3592
SMILESCc1cc(C(=O)Nc2cnc3[nH]ccc3c2)c2nc(C)nc(N)c2c1