Reaction Details
TargetIndoleamine 2,3-dioxygenase 1
LigandBDBM24813
Substrate/Competitorn/a
Meas. Tech.ChEMBL_716830 (CHEMBL1670752)
Ki 12000±n/a nM
Citation Dolušic, ELarrieu, PBlanc, SSapunaric, FNorberg, BMoineaux, LColette, DStroobant, VPilotte, LColau, DFerain, TFraser, GGalleni, MGaleni, MFrère, JMMasereel, BVan den Eynde, BWouters, JFrédérick, R Indol-2-yl ethanones as novel indoleamine 2,3-dioxygenase (IDO) inhibitors. Bioorg Med Chem19:1550-61 (2011) 
 
Indoleamine 2,3-dioxygenase 1
Name:Indoleamine 2,3-dioxygenase 1
Type:Enzyme
Mol. Mass.:45330.80
Organism:Homo sapiens (Human)
Description:P14902
Residue:403
BDBM24813
NameBDBM24813
Synonyms:Brassinin, 1 methyl N-(1H-indol-3-ylmethyl)carbamodithioate
TypeSmall organic molecule
Emp. Form.C11H12N2S2
Mol. Mass.236.356
SMILESCSC(=S)NCc1c[nH]c2ccccc12