Reaction Details
TargetVascular endothelial growth factor receptor 3
LigandBDBM50336460
Substrate/Competitorn/a
Meas. Tech.ChEMBL_716851 (CHEMBL1670830)
IC50 1600±n/a nM
Citation Napolitano, CNatoni, ASantocanale, CEvensen, LLorens, JBMurphy, PV Isosteric replacement of the Z-enone with haloethyl ketone and E-enone in a resorcylic acid lactone series and biological evaluation. Bioorg Med Chem Lett21:1167-70 (2011) 
 
Vascular endothelial growth factor receptor 3
Name:Vascular endothelial growth factor receptor 3
Type:Protein
Mol. Mass.:152749.58
Organism:Homo sapiens (Human)
Description:P35916-2
Residue:1363
BDBM50336460
NameBDBM50336460
Synonyms:(S,9E,15Z)-2-ethyl-4,7-dimethyl-5,11-dimethylene-5,6,7,8,11,12,13,14-octahydrobenzo[14]annulene | CHEMBL1668420
TypeSmall organic molecule
Emp. Form.C19H22O5
Mol. Mass.330.375
SMILESCOc1cc(O)c2c(c1)C=CCCCC(=O)C=CC[C@H](C)OC2=O