Reaction Details
TargetVascular endothelial growth factor receptor 1
LigandBDBM50336457
Substrate/Competitorn/a
Meas. Tech.ChEMBL_716849 (CHEMBL1670771)
IC50 12±n/a nM
Citation Napolitano, CNatoni, ASantocanale, CEvensen, LLorens, JBMurphy, PV Isosteric replacement of the Z-enone with haloethyl ketone and E-enone in a resorcylic acid lactone series and biological evaluation. Bioorg Med Chem Lett21:1167-70 (2011) 
 
Vascular endothelial growth factor receptor 1
Name:Vascular endothelial growth factor receptor 1
Type:Receptor Tyrosine Kinase
Mol. Mass.:150800.23
Organism:Homo sapiens (Human)
Description:P17948
Residue:1338
BDBM50336457
NameBDBM50336457
Synonyms:(3S,5Z,8S,9R,11E)-8,9,16-trihydroxy-14-methoxy-3-methyl-3,4,9,10-tetrahydro-1H-benzo[c][1]oxacyclotetradecine-1,7(8H)-dione CHEMBL1668411 | CHEMBL1801950
TypeSmall organic molecule
Emp. Form.C19H22O7
Mol. Mass.362.3738
SMILESCOc1cc(O)c2c(CCCC(=O)C(=O)C(=O)CCC[C@H](C)OC2=O)c1