Reaction Details
TargetMast/stem cell growth factor receptor Kit
LigandBDBM50336460
Substrate/Competitorn/a
Meas. Tech.ChEMBL_716845 (CHEMBL1670767)
IC50 1400±n/a nM
Citation Napolitano, CNatoni, ASantocanale, CEvensen, LLorens, JBMurphy, PV Isosteric replacement of the Z-enone with haloethyl ketone and E-enone in a resorcylic acid lactone series and biological evaluation. Bioorg Med Chem Lett21:1167-70 (2011) 
 
Mast/stem cell growth factor receptor Kit
Name:Mast/stem cell growth factor receptor Kit
Type:Protein
Mol. Mass.:109869.37
Organism:Homo sapiens (Human)
Description:P10721
Residue:976
BDBM50336460
NameBDBM50336460
Synonyms:(S,9E,15Z)-2-ethyl-4,7-dimethyl-5,11-dimethylene-5,6,7,8,11,12,13,14-octahydrobenzo[14]annulene | CHEMBL1668420
TypeSmall organic molecule
Emp. Form.C19H22O5
Mol. Mass.330.375
SMILESCOc1cc(O)c2c(c1)C=CCCCC(=O)C=CC[C@H](C)OC2=O