Reaction Details
TargetVascular endothelial growth factor receptor 1
LigandBDBM50336461
Substrate/Competitorn/a
Meas. Tech.ChEMBL_716849 (CHEMBL1670771)
IC50 33000±n/a nM
Citation Napolitano, CNatoni, ASantocanale, CEvensen, LLorens, JBMurphy, PV Isosteric replacement of the Z-enone with haloethyl ketone and E-enone in a resorcylic acid lactone series and biological evaluation. Bioorg Med Chem Lett21:1167-70 (2011) 
 
Vascular endothelial growth factor receptor 1
Name:Vascular endothelial growth factor receptor 1
Type:Receptor Tyrosine Kinase
Mol. Mass.:150800.23
Organism:Homo sapiens (Human)
Description:P17948
Residue:1338
BDBM50336461
NameBDBM50336461
Synonyms:(S,E)-16-hydroxy-14-methoxy-3-methyl-3,4,9,10,11,12-hexahydro-1H-benzo[c][1]oxacyclotetradecine-1,7(8H)-dione | CHEMBL1668419
TypeSmall organic molecule
Emp. Form.C19H24O5
Mol. Mass.332.3909
SMILESCOc1cc(O)c2c(CCCCCC(=O)C=CC[C@H](C)OC2=O)c1