Reaction Details
TargetMast/stem cell growth factor receptor Kit
LigandBDBM50336462
Substrate/Competitorn/a
Meas. Tech.ChEMBL_716845 (CHEMBL1670767)
IC50 2800±n/a nM
Citation Napolitano, CNatoni, ASantocanale, CEvensen, LLorens, JBMurphy, PV Isosteric replacement of the Z-enone with haloethyl ketone and E-enone in a resorcylic acid lactone series and biological evaluation. Bioorg Med Chem Lett21:1167-70 (2011) 
 
Mast/stem cell growth factor receptor Kit
Name:Mast/stem cell growth factor receptor Kit
Type:Protein
Mol. Mass.:109869.37
Organism:Homo sapiens (Human)
Description:P10721
Residue:976
BDBM50336462
NameBDBM50336462
Synonyms:(3S,5R,E)-5-bromo-16-hydroxy-14-methoxy-3-methyl-3,4,5,6,9,10-hexahydro-1H-benzo[c][1]oxacyclotetradecine-1,7(8H)-dione | CHEMBL1668414
TypeSmall organic molecule
Emp. Form.C19H23BrO5
Mol. Mass.411.287
SMILESCOc1cc(O)c2c(c1)\C=C\CCCC(=O)C[C@H](Br)C[C@H](C)OC2=O