Reaction Details
TargetMast/stem cell growth factor receptor Kit
LigandBDBM50336466
Substrate/Competitorn/a
Meas. Tech.ChEMBL_716845 (CHEMBL1670767)
IC50>100000±n/a nM
Citation Napolitano, CNatoni, ASantocanale, CEvensen, LLorens, JBMurphy, PV Isosteric replacement of the Z-enone with haloethyl ketone and E-enone in a resorcylic acid lactone series and biological evaluation. Bioorg Med Chem Lett21:1167-70 (2011) 
 
Mast/stem cell growth factor receptor Kit
Name:Mast/stem cell growth factor receptor Kit
Type:Protein
Mol. Mass.:109869.37
Organism:Homo sapiens (Human)
Description:P10721
Residue:976
BDBM50336466
NameBDBM50336466
Synonyms:(3S,5R,E)-5-chloro-16-hydroxy-14-methoxy-3-methyl-3,4,5,6,9,10-hexahydro-1H-benzo[c][1]oxacyclotetradecine-1,7(8H)-dione | CHEMBL1668412
TypeSmall organic molecule
Emp. Form.C19H23ClO5
Mol. Mass.366.836
SMILESCOc1cc(O)c2c(c1)\C=C\CCCC(=O)C[C@H](Cl)C[C@H](C)OC2=O