Reaction Details
TargetReceptor-type tyrosine-protein kinase FLT3
LigandBDBM50335376
Substrate/Competitorn/a
Meas. Tech.ChEMBL_716850 (CHEMBL1670772)
IC50 850±n/a nM
Citation Napolitano, CNatoni, ASantocanale, CEvensen, LLorens, JBMurphy, PV Isosteric replacement of the Z-enone with haloethyl ketone and E-enone in a resorcylic acid lactone series and biological evaluation. Bioorg Med Chem Lett21:1167-70 (2011) 
 
Receptor-type tyrosine-protein kinase FLT3
Name:Receptor-type tyrosine-protein kinase FLT3
Type:Enzyme
Mol. Mass.:112888.62
Organism:Homo sapiens (Human)
Description:P36888
Residue:993
BDBM50335376
NameBDBM50335376
Synonyms:(S)-16-hydroxy-14-methoxy-3-methyl-3,4,9,10,11,12-hexahydro-1H-benzo[c][1]oxacyclotetradecine-1,7(8H)-dione CHEMBL1651523
TypeSmall organic molecule
Emp. Form.C19H24O5
Mol. Mass.332.3909
SMILESCOc1cc(O)c2c(CCCCCC(=O)C=CC[C@H](C)OC2=O)c1