Reaction Details
TargetVascular endothelial growth factor receptor 2
LigandBDBM50336459
Substrate/Competitorn/a
Meas. Tech.ChEMBL_716854 (CHEMBL1670833)
IC50 1000±n/a nM
Citation Napolitano, CNatoni, ASantocanale, CEvensen, LLorens, JBMurphy, PV Isosteric replacement of the Z-enone with haloethyl ketone and E-enone in a resorcylic acid lactone series and biological evaluation. Bioorg Med Chem Lett21:1167-70 (2011) 
 
Vascular endothelial growth factor receptor 2
Name:Vascular endothelial growth factor receptor 2
Type:Receptor Tyrosine Kinase
Mol. Mass.:151510.97
Organism:Homo sapiens (Human)
Description:P35968
Residue:1356
BDBM50336459
NameBDBM50336459
Synonyms:(S,5E,11E)-16-hydroxy-14-methoxy-3-methyl-3,4,9,10-tetrahydro-1H-benzo[c][1]oxacyclotetradecine-1,7(8H)-dione | CHEMBL1668418
TypeSmall organic molecule
Emp. Form.C19H22O5
Mol. Mass.330.375
SMILESCOc1cc(O)c2c(c1)C=CCCCC(=O)C=CC[C@H](C)OC2=O