Reaction Details
TargetDual specificity mitogen-activated protein kinase kinase 1
LigandBDBM50336459
Substrate/Competitorn/a
Meas. Tech.ChEMBL_716855 (CHEMBL1670834)
IC50 22000±n/a nM
Citation Napolitano, CNatoni, ASantocanale, CEvensen, LLorens, JBMurphy, PV Isosteric replacement of the Z-enone with haloethyl ketone and E-enone in a resorcylic acid lactone series and biological evaluation. Bioorg Med Chem Lett21:1167-70 (2011) 
 
Dual specificity mitogen-activated protein kinase kinase 1
Name:Dual specificity mitogen-activated protein kinase kinase 1
Type:Other Protein Type
Mol. Mass.:43439.03
Organism:Homo sapiens (Human)
Description:Full-length human MEK-1 was generated by PCR and purified as a fusion protein from Escherichia coli lysates.
Residue:393
BDBM50336459
NameBDBM50336459
Synonyms:(S,5E,11E)-16-hydroxy-14-methoxy-3-methyl-3,4,9,10-tetrahydro-1H-benzo[c][1]oxacyclotetradecine-1,7(8H)-dione | CHEMBL1668418
TypeSmall organic molecule
Emp. Form.C19H22O5
Mol. Mass.330.375
SMILESCOc1cc(O)c2c(c1)C=CCCCC(=O)C=CC[C@H](C)OC2=O