Reaction Details
TargetCarbonic anhydrase 2
LigandBDBM50336488
Substrate/Competitorn/a
Meas. Tech.ChEMBL_716903 (CHEMBL1670882)
Ki 500±n/a nM
Citation Durdagi, SSentürk, MEkinci, DBalaydin, HTGöksu, SKüfrevioglu, ÖIInnocenti, AScozzafava, ASupuran, CT Kinetic and docking studies of phenol-based inhibitors of carbonic anhydrase isoforms I, II, IX and XII evidence a new binding mode within the enzyme active site. Bioorg Med Chem19:1381-9 (2011) 
 
Carbonic anhydrase 2
Name:Carbonic anhydrase 2
Type:Enzyme
Mol. Mass.:29250.71
Organism:Homo sapiens (Human)
Description:P00918
Residue:260
BDBM50336488
NameBDBM50336488
Synonyms:1,2-dimethoxybenzene | CHEMBL1668603
TypeSmall organic molecule
Emp. Form.C8H10O2
Mol. Mass.138.1638
SMILESCOc1ccccc1OC