Reaction Details
TargetCarbonic anhydrase 9
LigandBDBM50336489
Substrate/Competitorn/a
Meas. Tech.ChEMBL_716904 (CHEMBL1670883)
Ki 4060±n/a nM
Citation Durdagi, SSentürk, MEkinci, DBalaydin, HTGöksu, SKüfrevioglu, ÖIInnocenti, AScozzafava, ASupuran, CT Kinetic and docking studies of phenol-based inhibitors of carbonic anhydrase isoforms I, II, IX and XII evidence a new binding mode within the enzyme active site. Bioorg Med Chem19:1381-9 (2011) 
 
Carbonic anhydrase 9
Name:Carbonic anhydrase 9
Type:Enzyme
Mol. Mass.:49669.03
Organism:Homo sapiens (Human)
Description:Catalytic domain of human cloned isozyme was used in the assay
Residue:459
BDBM50336489
NameBDBM50336489
Synonyms:1,2,4-trimethoxybenzene | CHEMBL1668605
TypeSmall organic molecule
Emp. Form.C9H12O3
Mol. Mass.168.1898
SMILESCOc1ccc(OC)c(OC)c1