Reaction Details
TargetCarbonic anhydrase 12
LigandBDBM50336488
Substrate/Competitorn/a
Meas. Tech.ChEMBL_716905 (CHEMBL1670884)
Ki 8360±n/a nM
Citation Durdagi, SSentürk, MEkinci, DBalaydin, HTGöksu, SKüfrevioglu, ÖIInnocenti, AScozzafava, ASupuran, CT Kinetic and docking studies of phenol-based inhibitors of carbonic anhydrase isoforms I, II, IX and XII evidence a new binding mode within the enzyme active site. Bioorg Med Chem19:1381-9 (2011) 
 
Carbonic anhydrase 12
Name:Carbonic anhydrase 12
Type:Enzyme
Mol. Mass.:39456.00
Organism:Homo sapiens (Human)
Description:Catalytic domain of human cloned isozyme was used in the assay
Residue:354
BDBM50336488
NameBDBM50336488
Synonyms:1,2-dimethoxybenzene | CHEMBL1668603
TypeSmall organic molecule
Emp. Form.C8H10O2
Mol. Mass.138.1638
SMILESCOc1ccccc1OC