Reaction Details
TargetCarbonic anhydrase 12
LigandBDBM50336490
Substrate/Competitorn/a
Meas. Tech.ChEMBL_716905 (CHEMBL1670884)
Ki 3670±n/a nM
Citation Durdagi, SSentürk, MEkinci, DBalaydin, HTGöksu, SKüfrevioglu, ÖIInnocenti, AScozzafava, ASupuran, CT Kinetic and docking studies of phenol-based inhibitors of carbonic anhydrase isoforms I, II, IX and XII evidence a new binding mode within the enzyme active site. Bioorg Med Chem19:1381-9 (2011) 
 
Carbonic anhydrase 12
Name:Carbonic anhydrase 12
Type:Enzyme
Mol. Mass.:39456.00
Organism:Homo sapiens (Human)
Description:Catalytic domain of human cloned isozyme was used in the assay
Residue:354
BDBM50336490
NameBDBM50336490
Synonyms:3,5-DIHYDROXYBENZOATE 3,5-Dihydroxybenzoate, IX 3,5-dihydroxybenzoicacid | CHEMBL95308
TypeSmall organic molecule
Emp. Form.C7H6O4
Mol. Mass.154.1201
SMILESOC(=O)c1cc(O)cc(O)c1