Reaction Details
TargetMultidrug resistance protein MdtK
LigandBDBM50336500
Substrate/Competitorn/a
Meas. Tech.ChEMBL_720700 (CHEMBL1681167)
Kd 3000±n/a nM
Citation Long, FRouquette-Loughlin, CShafer, WMYu, EW Functional cloning and characterization of the multidrug efflux pumps NorM from Neisseria gonorrhoeae and YdhE from Escherichia coli. Antimicrob Agents Chemother52:3052-60 (2008) 
 
Multidrug resistance protein MdtK
Name:Multidrug resistance protein MdtK
Type:PROTEIN
Mol. Mass.:49460.10
Organism:Escherichia coli (strain K12)
Description:ChEMBL_720698
Residue:457
BDBM50336500
NameBDBM50336500
Synonyms:(E)-N-(9-(2-(ethoxycarbonyl)phenyl)-6-(ethylamino)-2,7-dimethyl-3H-xanthen-3-ylidene)ethanaminium chloride [9-(2-ethoxycarbonyl-phenyl)-6-ethylamino-2,7-dimethyl-xanthen-(3E)-ylidene]-ethyl-ammonium; chloride | rhodamine 6G
TypeSmall organic molecule
Emp. Form.C28H30N2O3
Mol. Mass.442.5494
SMILESCCNc1cc2oc3c\c(=N/CC)c(C)cc3c(-c3ccccc3C(=O)OCC)c2cc1C