Reaction Details
TargetMycocyclosin synthase
LigandBDBM25817
Substrate/Competitorn/a
Meas. Tech.ChEMBL_721243 (CHEMBL1675120)
Kd 6000±n/a nM
Citation Warrilow, AGJackson, CJParker, JEMarczylo, THKelly, DELamb, DCKelly, SL Identification, characterization, and azole-binding properties of Mycobacterium smegmatis CYP164A2, a homolog of ML2088, the sole cytochrome P450 gene of Mycobacterium leprae. Antimicrob Agents Chemother53:1157-64 (2009) 
 
Mycocyclosin synthase
Name:Mycocyclosin synthase
Type:PROTEIN
Mol. Mass.:43255.98
Organism:Mycobacterium tuberculosis
Description:ChEMBL_721243
Residue:396
BDBM25817
NameBDBM25817
Synonyms:2-(2,4-difluorophenyl)-1,3-bis(1H-1,2,4-triazol-1-yl)propan-2-ol Diflucan Fluconazole (f) Triflucan US11247981, Example Fluconazole US9144538, Fluconazole US9556143, Fluconazole | cid_3365
TypeSmall organic molecule
Emp. Form.C13H12F2N6O
Mol. Mass.306.2708
SMILESOC(Cn1cncn1)(Cn1cncn1)c1ccc(F)cc1F