Reaction Details
TargetLanosterol 14-alpha demethylase
LigandBDBM31768
Substrate/Competitorn/a
Meas. Tech.ChEMBL_721244 (CHEMBL1675121)
Kd 110±n/a nM
Citation Warrilow, AGJackson, CJParker, JEMarczylo, THKelly, DELamb, DCKelly, SL Identification, characterization, and azole-binding properties of Mycobacterium smegmatis CYP164A2, a homolog of ML2088, the sole cytochrome P450 gene of Mycobacterium leprae. Antimicrob Agents Chemother53:1157-64 (2009) 
 
Lanosterol 14-alpha demethylase
Name:Lanosterol 14-alpha demethylase
Type:Protein
Mol. Mass.:56817.21
Organism:Homo sapiens (Human)
Description:Q16850
Residue:503
BDBM31768
NameBDBM31768
Synonyms:CHEMBL295698 Nizoral | Panfungol
TypeSmall organic molecule
Emp. Form.C26H28Cl2N4O4
Mol. Mass.531.431
SMILESCC(=O)N1CCN(CC1)c1ccc(OC[C@@H]2CO[C@](Cn3ccnc3)(O2)c2ccc(Cl)cc2Cl)cc1