Reaction Details
TargetGeranylgeranyl pyrophosphate synthase
LigandBDBM25259
Substrate/Competitorn/a
Meas. Tech.ChEMBL_724759 (CHEMBL1676999)
Ki 6900±n/a nM
Citation Singh, APZhang, YNo, JHDocampo, RNussenzweig, VOldfield, E Lipophilic bisphosphonates are potent inhibitors of Plasmodium liver-stage growth. Antimicrob Agents Chemother54:2987-93 (2010) 
 
Geranylgeranyl pyrophosphate synthase
Name:Geranylgeranyl pyrophosphate synthase
Type:Homooctamer; transferase
Mol. Mass.:34867.94
Organism:Homo sapiens (Human)
Description:Recombinant human GGPPS was cloned and expressed in E. coli.
Residue:300
BDBM25259
NameBDBM25259
Synonyms:3-(decyloxy)-1-(2-hydrogen phosphonato-2-phosphonoethyl)pyridin-1-ium bisphosphonate, 15
TypeSmall organic molecule
Emp. Form.C17H31NO7P2
Mol. Mass.423.3781
SMILESCCCCCCCCCCOc1ccc[n+](CC(P(O)(O)=O)P(O)([O-])=O)c1