Reaction Details
TargetGeranylgeranyl pyrophosphate synthase
LigandBDBM50336506
Substrate/Competitorn/a
Meas. Tech.ChEMBL_724759 (CHEMBL1676999)
Ki 3300±n/a nM
Citation Singh, APZhang, YNo, JHDocampo, RNussenzweig, VOldfield, E Lipophilic bisphosphonates are potent inhibitors of Plasmodium liver-stage growth. Antimicrob Agents Chemother54:2987-93 (2010) 
 
Geranylgeranyl pyrophosphate synthase
Name:Geranylgeranyl pyrophosphate synthase
Type:Homooctamer; transferase
Mol. Mass.:34867.94
Organism:Homo sapiens (Human)
Description:Recombinant human GGPPS was cloned and expressed in E. coli.
Residue:300
BDBM50336506
NameBDBM50336506
Synonyms:2-(decyl(methyl)amino)ethane-1,1-diyldiphosphonic acid CHEMBL1673218
TypeSmall organic molecule
Emp. Form.C13H31NO6P2
Mol. Mass.359.3359
SMILESCCCCCCCCCCN(C)CC(P(O)(O)=O)P(O)(O)=O