Reaction Details
TargetDihydrofolate reductase
LigandBDBM18069
Substrate/Competitorn/a
Meas. Tech.ChEMBL_723694 (CHEMBL1677364)
Ki 4.4±n/a nM
Citation Bourne, CRBarrow, EWBunce, RABourne, PCBerlin, KDBarrow, WW Inhibition of antibiotic-resistant Staphylococcus aureus by the broad-spectrum dihydrofolate reductase inhibitor RAB1. Antimicrob Agents Chemother54:3825-33 (2010) 
 
Dihydrofolate reductase
Name:Dihydrofolate reductase
Type:Enzyme
Mol. Mass.:18249.71
Organism:Staphylococcus aureus
Description:n/a
Residue:159
BDBM18069
NameBDBM18069
Synonyms:5-[(3,4,5-trimethoxyphenyl)methyl]pyrimidine-2,4-diamine TMP Trimethoprim (TMP) | US10870625, Compound TMP
TypeSmall organic molecule
Emp. Form.C14H18N4O3
Mol. Mass.290.3177
SMILESCOc1cc(Cc2cnc(N)nc2N)cc(OC)c1OC