Reaction Details
TargetLanosterol 14a-demethylase
LigandBDBM50127138
Substrate/Competitorn/a
Meas. Tech.ChEMBL_724295 (CHEMBL1677688)
Kd 31±n/a nM
Citation Warrilow, AGMelo, NMartel, CMParker, JENes, WDKelly, SLKelly, DE Expression, purification, and characterization of Aspergillus fumigatus sterol 14-alpha demethylase (CYP51) isoenzymes A and B. Antimicrob Agents Chemother54:4225-34 (2010) 
 
Lanosterol 14a-demethylase
Name:Lanosterol 14a-demethylase
Synonyms:14-alpha sterol demethylase
Type:PROTEIN
Mol. Mass.:58939.22
Organism:Neosartorya fumigata
Description:ChEMBL_724288
Residue:524
BDBM50127138
NameBDBM50127138
TypeSmall organic molecule
Emp. Form.C35H38Cl2N8O4
Mol. Mass.705.633
SMILESCCC(C)n1ncn(-c2ccc(cc2)N2CCN(CC2)c2ccc(OC[C@H]3CO[C@@](Cn4cncn4)(O3)c3ccc(Cl)cc3Cl)cc2)c1=O