Reaction Details
TargetMuscarinic acetylcholine receptor M3
LigandBDBM10759
Substrate/Competitorn/a
Meas. Tech.ChEMBL_723353 (CHEMBL1673550)
EC50 220±n/a nM
Citation Ziegler, NBätz, JZabel, ULohse, MJHoffmann, C FRET-based sensors for the human M1-, M3-, and M5-acetylcholine receptors. Bioorg Med Chem19:1048-54 (2011) 
 
Muscarinic acetylcholine receptor M3
Name:Muscarinic acetylcholine receptor M3
Type:Enzyme
Mol. Mass.:66151.03
Organism:Homo sapiens (Human)
Description:P20309
Residue:590
BDBM10759
NameBDBM10759
Synonyms:2-acetoxyethyl(trimethyl)ammonium;bromide CHEMBL667 [2-(acetyloxy)ethyl]trimethylazanium acetylcholine chloride | cid_6060
TypeSmall Organic Molecule
Emp. Form.C7H16NO2
Mol. Mass.146.2069
SMILESCC(=O)OCC[N+](C)(C)C