Reaction Details
TargetNeutrophil elastase
LigandBDBM50326056
Substrate/Competitorn/a
Meas. Tech.ChEMBL_724198 (CHEMBL1677262)
IC50 680±n/a nM
Citation White, PWLlinàs-Brunet, MAmad, MBethell, RCBolger, GCordingley, MGDuan, JGarneau, MLagacé, LThibeault, DKukolj, G Preclinical characterization of BI 201335, a C-terminal carboxylic acid inhibitor of the hepatitis C virus NS3-NS4A protease. Antimicrob Agents Chemother54:4611-8 (2010) 
 
Neutrophil elastase
Name:Neutrophil elastase
Type:Enzyme
Mol. Mass.:28532.38
Organism:Homo sapiens (Human)
Description:P08246
Residue:267
BDBM50326056
NameBDBM50326056
Synonyms:(1S,3aR,6aS)-2-((S)-2-((S)-2-cyclohexyl-2-(pyrazine-2-carboxamido)acetamido)-3,3-dimethylbutanoyl)-N-((S)-1-(cyclopropylamino)-1,2-dioxohexan-3-yl)octahydrocyclopenta[c]pyrrole-1-carboxamide (1S,3aR,6aS)-2-((S)-2-((S)-2-cyclohexyl-2-(pyrazine-6-carboxamido)acetamido)-3,3-dimethylbutanoyl)-N-((S)-1-(cyclopropylamino)-1,2-dioxohexan-3-yl)-octahydrocyclopenta[c]pyrrole-1-carboxamide TELAPREVIR VX-950
TypeSmall organic molecule
Emp. Form.C36H53N7O6
Mol. Mass.679.8493
SMILESCCC[C@H](NC(=O)[C@@H]1[C@H]2CCC[C@H]2CN1C(=O)[C@@H](NC(=O)[C@@H](NC(=O)c1cnccn1)C1CCCCC1)C(C)(C)C)C(=O)C(=O)NC1CC1