Reaction Details
TargetSubstance-P receptor
LigandBDBM50417979
Substrate/Competitorn/a
Meas. Tech.ChEMBL_725399 (CHEMBL1676922)
Ki 0.275423±n/a nM
Citation Di Fabio, RAlvaro, GGriffante, CPizzi, DADonati, DMattioli, MCimarosti, ZGuercio, GMarchioro, CProvera, SZonzini, LMontanari, DMelotto, SGerrard, PATrist, DGRatti, ECorsi, M Discovery and biological characterization of (2R,4S)-1'-acetyl-N-{(1R)-1-[3,5-bis(trifluoromethyl)phenyl]ethyl}-2-(4-fluoro-2-methylphenyl)-N-methyl-4,4'-bipiperidine-1-carboxamide as a new potent and selective neurokinin 1 (NK1) receptor antagonist clinical candidate. J Med Chem54:1071-9 (2011) 
 
Substance-P receptor
Name:Substance-P receptor
Type:G Protein-Coupled Receptor (GPCR)
Mol. Mass.:46254.43
Organism:Homo sapiens (Human)
Description:P25103
Residue:407
BDBM50417979
NameBDBM50417979
Synonyms:CHEMBL1672050
TypeSmall organic molecule
Emp. Form.C27H30F7N3O
Mol. Mass.545.5354
SMILESCN(Cc1cc(cc(c1)C(F)(F)F)C(F)(F)F)C(=O)N1CC[C@@H](C[C@@H]1c1ccc(F)cc1C)N1CCCC1