Reaction Details
TargetInduced myeloid leukemia cell differentiation protein Mcl-1
LigandBDBM50336585
Substrate/Competitorn/a
Meas. Tech.ChEMBL_725602 (CHEMBL1677785)
Ki 151±n/a nM
Citation Zhang, ZWu, GXie, FSong, TChang, X 3-Thiomorpholin-8-oxo-8H-acenaphtho[1,2-b]pyrrole-9-carbonitrile (S1) based molecules as potent, dual inhibitors of B-cell lymphoma 2 (Bcl-2) and myeloid cell leukemia sequence 1 (Mcl-1): structure-based design and structure-activity relationship studies. J Med Chem54:1101-5 (2011) 
 
Induced myeloid leukemia cell differentiation protein Mcl-1
Name:Induced myeloid leukemia cell differentiation protein Mcl-1
Type:Membrane; Single-pass membrane protein
Mol. Mass.:37332.87
Organism:Homo sapiens (Human)
Description:Q07820
Residue:350
BDBM50336585
NameBDBM50336585
Synonyms:3-(4-methoxyphenylthio)-8-oxo-8H-acenaphtho[1,2-b]pyrrole-9-carbonitrile | CHEMBL1672077
TypeSmall organic molecule
Emp. Form.C22H12N2O2S
Mol. Mass.368.408
SMILESCOc1ccc(Sc2ccc3c4c(C#N)c(=O)nc4c4cccc2c34)cc1