Reaction Details
TargetMu-type opioid receptor
LigandBDBM50336593
Substrate/Competitorn/a
Meas. Tech.ChEMBL_725617 (CHEMBL1677800)
Ki 0.830000±n/a nM
Citation Spetea, MWindisch, PGuo, YBileviciute-Ljungar, ISchütz, JAsim, MFBerzetei-Gurske, IPRiba, PKiraly, KFürst, SAl-Khrasani, MSchmidhammer, H Synthesis and pharmacological activities of 6-glycine substituted 14-phenylpropoxymorphinans, a novel class of opioids with high opioid receptor affinities and antinociceptive potencies. J Med Chem54:980-8 (2011) 
 
Mu-type opioid receptor
Name:Mu-type opioid receptor
Type:G Protein-Coupled Receptor (GPCR)
Mol. Mass.:44503.11
Organism:Rattus norvegicus (rat)
Description:Competition binding assays were carried out using membrane preparations from transfected HN9.10 cells that constitutively expressed the mu opioid receptor.
Residue:398
BDBM50336593
NameBDBM50336593
Synonyms:2-{[(1S,5R,13R,14R,17S)-10-hydroxy-17-methoxy-4-methyl-12-oxa-4-azapentacyclo[9.6.1.0^{1,13}.0^{5,17}.0^{7,18}]octadeca-7(18),8,10-trien-14-yl]amino}acetic acid | CHEMBL1672085
TypeSmall organic molecule
Emp. Form.C20H26N2O5
Mol. Mass.374.4308
SMILESCO[C@]12CC[C@@H](NCC(O)=O)[C@@H]3Oc4c5c(C[C@H]1N(C)CC[C@@]235)ccc4O