Reaction Details
TargetMu-type opioid receptor
LigandBDBM50336594
Substrate/Competitorn/a
Meas. Tech.ChEMBL_725617 (CHEMBL1677800)
Ki 1.4±n/a nM
Citation Spetea, MWindisch, PGuo, YBileviciute-Ljungar, ISchütz, JAsim, MFBerzetei-Gurske, IPRiba, PKiraly, KFürst, SAl-Khrasani, MSchmidhammer, H Synthesis and pharmacological activities of 6-glycine substituted 14-phenylpropoxymorphinans, a novel class of opioids with high opioid receptor affinities and antinociceptive potencies. J Med Chem54:980-8 (2011) 
 
Mu-type opioid receptor
Name:Mu-type opioid receptor
Type:G Protein-Coupled Receptor (GPCR)
Mol. Mass.:44503.11
Organism:Rattus norvegicus (rat)
Description:Competition binding assays were carried out using membrane preparations from transfected HN9.10 cells that constitutively expressed the mu opioid receptor.
Residue:398
BDBM50336594
NameBDBM50336594
Synonyms:CHEMBL1672086 | tert-butyl 2-{[(1S,5R,13R,14S,17S)-10-hydroxy-4-methyl-17-(3-phenylpropoxy)-12-oxa-4-azapentacyclo[9.6.1.0^{1,13}.0^{5,17}.0^{7,18}]octadeca-7(18),8,10-trien-14-yl]amino}acetate
TypeSmall organic molecule
Emp. Form.C32H42N2O5
Mol. Mass.534.6863
SMILESCN1CC[C@@]23[C@H]4Oc5c2c(C[C@@H]1[C@@]3(CC[C@@H]4NCC(=O)OC(C)(C)C)OCCCc1ccccc1)ccc5O