Reaction Details
TargetMu-type opioid receptor
LigandBDBM50336601
Substrate/Competitorn/a
Meas. Tech.ChEMBL_725805 (CHEMBL1678401)
EC50 1.28±n/a nM
Citation Spetea, MWindisch, PGuo, YBileviciute-Ljungar, ISchütz, JAsim, MFBerzetei-Gurske, IPRiba, PKiraly, KFürst, SAl-Khrasani, MSchmidhammer, H Synthesis and pharmacological activities of 6-glycine substituted 14-phenylpropoxymorphinans, a novel class of opioids with high opioid receptor affinities and antinociceptive potencies. J Med Chem54:980-8 (2011) 
 
Mu-type opioid receptor
Name:Mu-type opioid receptor
Type:G Protein-Coupled Receptor (GPCR)
Mol. Mass.:44789.51
Organism:Homo sapiens (Human)
Description:P35372
Residue:400
BDBM50336601
NameBDBM50336601
Synonyms:CHEMBL3216476 | [[17-Cyclopropylmethyl-4,5alpha-epoxy-3-hydroxy-14beta-[(3-phenylpropyl)oxy]morphinan-6beta-yl]amino]acetic Acid Dihydrochloride
TypeSmall organic molecule
Emp. Form.C31H40Cl2N2O5
Mol. Mass.591.566
SMILESCl.Cl.[H][C@@]12Oc3c4c(C[C@@]5([H])N(CC6CC6)CC[C@@]14[C@]5(CC[C@@H]2NCC(O)=O)OCCCc1ccccc1)ccc3O