Reaction Details
TargetDelta-type opioid receptor
LigandBDBM50336609
Substrate/Competitorn/a
Meas. Tech.ChEMBL_725831 (CHEMBL1678427)
Ki 359±n/a nM
Citation Cheng, KLee, YSRothman, RBDersch, CMBittman, RWJacobson, AERice, KC Probes for narcotic receptor mediated phenomena. 41. Unusual inverseµ-agonists and potentµ-opioid antagonists by modification of the N-substituent in enantiomeric 5-(3-hydroxyphenyl)morphans. J Med Chem54:957-69 (2011) 
 
Delta-type opioid receptor
Name:Delta-type opioid receptor
Type:G Protein-Coupled Receptor (GPCR)
Mol. Mass.:40382.98
Organism:Homo sapiens (Human)
Description:Competition binding assays were carried out using membrane preparations from transfected HN9.10 cells that constitutively expressed the delta opioid receptor.
Residue:372
BDBM50336609
NameBDBM50336609
Synonyms:3-((1R,5S)-2-((Z)-3-phenylallyl)-2-azabicyclo[3.3.1]nonan-5-yl)phenol hydrochloride | CHEMBL1672180
TypeSmall organic molecule
Emp. Form.C23H27NO
Mol. Mass.333.4666
SMILESOc1cccc(c1)[C@@]12CCC[C@@H](C1)N(C\C=C/c1ccccc1)CC2