Reaction Details
TargetMu-type opioid receptor
LigandBDBM50336612
Substrate/Competitorn/a
Meas. Tech.ChEMBL_725830 (CHEMBL1678426)
Ki 76±n/a nM
Citation Cheng, KLee, YSRothman, RBDersch, CMBittman, RWJacobson, AERice, KC Probes for narcotic receptor mediated phenomena. 41. Unusual inverseµ-agonists and potentµ-opioid antagonists by modification of the N-substituent in enantiomeric 5-(3-hydroxyphenyl)morphans. J Med Chem54:957-69 (2011) 
 
Mu-type opioid receptor
Name:Mu-type opioid receptor
Type:G Protein-Coupled Receptor (GPCR)
Mol. Mass.:44789.51
Organism:Homo sapiens (Human)
Description:P35372
Residue:400
BDBM50336612
NameBDBM50336612
Synonyms:3-((1S,5R)-2-(((1'S,2'R)-2-Phenylcyclopropyl)methyl)-2-azabicyclo[3.3.1]nonan-5-yl)phenol hydrochloride | CHEMBL1672187
TypeSmall organic molecule
Emp. Form.C24H29NO
Mol. Mass.347.4932
SMILESOc1cccc(c1)[C@]12CCC[C@H](C1)N(C[C@H]1C[C@H]1c1ccccc1)CC2