Reaction Details
TargetKappa-type opioid receptor
LigandBDBM50336608
Substrate/Competitorn/a
Meas. Tech.ChEMBL_725832 (CHEMBL1678428)
Ki 123±n/a nM
Citation Cheng, KLee, YSRothman, RBDersch, CMBittman, RWJacobson, AERice, KC Probes for narcotic receptor mediated phenomena. 41. Unusual inverseµ-agonists and potentµ-opioid antagonists by modification of the N-substituent in enantiomeric 5-(3-hydroxyphenyl)morphans. J Med Chem54:957-69 (2011) 
 
Kappa-type opioid receptor
Name:Kappa-type opioid receptor
Type:G Protein-Coupled Receptor (GPCR)
Mol. Mass.:42648.76
Organism:Homo sapiens (Human)
Description:P41145
Residue:380
BDBM50336608
NameBDBM50336608
Synonyms:3-((1S,5R)-2-((Z)-3-phenylallyl)-2-azabicyclo[3.3.1]nonan-5-yl)-phenol hydrochloride | CHEMBL1672179
TypeSmall organic molecule
Emp. Form.C23H27NO
Mol. Mass.333.4666
SMILESOc1cccc(c1)[C@]12CCC[C@H](C1)N(C\C=C/c1ccccc1)CC2