Reaction Details
TargetMu-type opioid receptor
LigandBDBM50064519
Substrate/Competitorn/a
Meas. Tech.ChEMBL_725830 (CHEMBL1678426)
Ki 1.8±n/a nM
Citation Cheng, KLee, YSRothman, RBDersch, CMBittman, RWJacobson, AERice, KC Probes for narcotic receptor mediated phenomena. 41. Unusual inverseµ-agonists and potentµ-opioid antagonists by modification of the N-substituent in enantiomeric 5-(3-hydroxyphenyl)morphans. J Med Chem54:957-69 (2011) 
 
Mu-type opioid receptor
Name:Mu-type opioid receptor
Type:G Protein-Coupled Receptor (GPCR)
Mol. Mass.:44789.51
Organism:Homo sapiens (Human)
Description:P35372
Residue:400
BDBM50064519
NameBDBM50064519
Synonyms:3-[(3R,4R)-3,4-Dimethyl-1-((S)-2-phenyl-cyclopropylmethyl)-piperidin-4-yl]-phenol | CHEMBL292551
TypeSmall organic molecule
Emp. Form.C23H29NO
Mol. Mass.335.4825
SMILESC[C@H]1CN(CC2C[C@@H]2c2ccccc2)CC[C@@]1(C)c1cccc(O)c1