Reaction Details
TargetCarbonic anhydrase 1
LigandBDBM13063
Substrate/Competitorn/a
Meas. Tech.ChEMBL_726066 (CHEMBL1678662)
pH7.5±n/a
Ki 54000±n/a nM
Commentsextracted
Citation Joseph, POuahrani-Bettache, SMontero, JLNishimori, IMinakuchi, TVullo, DScozzafava, AWinum, JYKöhler, SSupuran, CT A newß-carbonic anhydrase from Brucella suis, its cloning, characterization, and inhibition with sulfonamides and sulfamates, leading to impaired pathogen growth. Bioorg Med Chem19:1172-8 (2011) 
 
Carbonic anhydrase 1
Name:Carbonic anhydrase 1
Type:Enzyme
Mol. Mass.:28873.37
Organism:Homo sapiens (Human)
Description:P00915
Residue:261
BDBM13063
NameBDBM13063
Synonyms:4-(5-methyl-3-phenyl-1,2-oxazol-4-yl)benzene-1-sulfonamide CHEMBL865 Valdecoxib | cid_119607
TypeSmall organic molecule
Emp. Form.C16H14N2O3S
Mol. Mass.314.359
SMILESCc1onc(c1-c1ccc(cc1)S(N)(=O)=O)-c1ccccc1