Reaction Details
TargetCarbonic anhydrase 2
LigandBDBM10858
Substrate/Competitorn/a
Meas. Tech.ChEMBL_726067 (CHEMBL1678663)
pH7.5±n/a
Ki 300±n/a nM
Commentsextracted
Citation Joseph, POuahrani-Bettache, SMontero, JLNishimori, IMinakuchi, TVullo, DScozzafava, AWinum, JYKöhler, SSupuran, CT A newß-carbonic anhydrase from Brucella suis, its cloning, characterization, and inhibition with sulfonamides and sulfamates, leading to impaired pathogen growth. Bioorg Med Chem19:1172-8 (2011) 
 
Carbonic anhydrase 2
Name:Carbonic anhydrase 2
Type:Enzyme
Mol. Mass.:29250.71
Organism:Homo sapiens (Human)
Description:P00918
Residue:260
BDBM10858
NameBDBM10858
Synonyms:4-hydrazinylbenzene-1-sulfonamide aromatic/heteroaromatic sulfonamide 3 | hydrazide deriv. 14
TypeSmall organic molecule
Emp. Form.C6H9N3O2S
Mol. Mass.187.22
SMILESNNc1ccc(cc1)S(N)(=O)=O