Reaction Details
TargetCarbonic anhydrase 2
LigandBDBM10863
Substrate/Competitorn/a
Meas. Tech.ChEMBL_726067 (CHEMBL1678663)
pH7.5±n/a
Ki 110±n/a nM
Commentsextracted
Citation Joseph, POuahrani-Bettache, SMontero, JLNishimori, IMinakuchi, TVullo, DScozzafava, AWinum, JYKöhler, SSupuran, CT A newß-carbonic anhydrase from Brucella suis, its cloning, characterization, and inhibition with sulfonamides and sulfamates, leading to impaired pathogen growth. Bioorg Med Chem19:1172-8 (2011) 
 
Carbonic anhydrase 2
Name:Carbonic anhydrase 2
Type:Enzyme
Mol. Mass.:29250.71
Organism:Homo sapiens (Human)
Description:P00918
Residue:260
BDBM10863
NameBDBM10863
Synonyms:4-Amino-3-chlorobenzenesulfonamide CHEMBL7092 halogenosulfanilamide deriv. 5c
TypeSmall organic molecule
Emp. Form.C6H7ClN2O2S
Mol. Mass.206.65
SMILESNc1ccc(cc1Cl)S(N)(=O)=O