Reaction Details
TargetCarbonic anhydrase 2
LigandBDBM50314771
Substrate/Competitorn/a
Meas. Tech.ChEMBL_726067 (CHEMBL1678663)
pH7.5±n/a
Ki 16±n/a nM
Commentsextracted
Citation Joseph, POuahrani-Bettache, SMontero, JLNishimori, IMinakuchi, TVullo, DScozzafava, AWinum, JYKöhler, SSupuran, CT A newß-carbonic anhydrase from Brucella suis, its cloning, characterization, and inhibition with sulfonamides and sulfamates, leading to impaired pathogen growth. Bioorg Med Chem19:1172-8 (2011) 
 
Carbonic anhydrase 2
Name:Carbonic anhydrase 2
Type:Enzyme
Mol. Mass.:29250.71
Organism:Homo sapiens (Human)
Description:P00918
Residue:260
BDBM50314771
NameBDBM50314771
Synonyms:4-((2R,3R,4R,5R)-3,4,5-trihydroxytetrahydro-2H-pyran-2-ylamino)benzenesulfonamide | CHEMBL1089967
TypeSmall organic molecule
Emp. Form.C11H16N2O6S
Mol. Mass.304.32
SMILESNS(=O)(=O)c1ccc(N[C@@H]2OC[C@@H](O)[C@@H](O)[C@H]2O)cc1